Target
Interstitial collagenase
Ligand
BDBM50177312
Substrate
Meas. Tech.
ChEMBL_334534 (CHEMBL862517)
Ki
>4949±n/a nM
Citation
 Cherney, RJKing, BWGilmore, JLLiu, RQCovington, MBDuan, JJDecicco, CP Conversion of potent MMP inhibitors into selective TACE inhibitors. Bioorg Med Chem Lett 16:1028-31 (2006)  
Target
Name:
Interstitial collagenase
Synonyms:
CLG MMP1 Matrix metalloproteinase-1 | Matrix metalloproteinase-1 (MMP-1)
Type:
Enzyme
Mol. Mass.:
54010.26
Organism:
Homo sapiens (Human)
Description:
P03956
Residue:
469
  
Inhibitor
Name:
BDBM50177312
Synonyms:
2-[4-(2-methyl-quinolin-4-ylmethoxy)-benzyl]-1,1-dioxo-isothiazolidine-3-carboxylic acid hydroxyamide | CHEMBL204495
Type:
Small organic molecule
Emp. Form.:
C22H23N3O5S
Mol. Mass.:
441.5
SMILES:
Cc1cc(COc2ccc(CN3C(CCS3(=O)=O)C(=O)NO)cc2)c2ccccc2n1
: