Target
Disintegrin and metalloproteinase domain-containing protein 17
Ligand
BDBM50177312
Substrate
Meas. Tech.
ChEMBL_334533 (CHEMBL862516)
IC50
900±n/a nM
Citation
 Cherney, RJKing, BWGilmore, JLLiu, RQCovington, MBDuan, JJDecicco, CP Conversion of potent MMP inhibitors into selective TACE inhibitors. Bioorg Med Chem Lett 16:1028-31 (2006)  
Target
Name:
Disintegrin and metalloproteinase domain-containing protein 17
Synonyms:
ADA17_HUMAN CSVP Disintegrin and metalloproteinase domain-containing protein 17 (ADAM17) TNF-alpha convertase TNF-alpha-converting enzyme (TACE) Tumor necrosis factor-α converting enzyme (TACE)
Type:
Enzyme
Mol. Mass.:
93007.89
Organism:
Homo sapiens (Human)
Description:
Residue:
824
  
Inhibitor
Name:
BDBM50177312
Synonyms:
2-[4-(2-methyl-quinolin-4-ylmethoxy)-benzyl]-1,1-dioxo-isothiazolidine-3-carboxylic acid hydroxyamide | CHEMBL204495
Type:
Small organic molecule
Emp. Form.:
C22H23N3O5S
Mol. Mass.:
441.5
SMILES:
Cc1cc(COc2ccc(CN3C(CCS3(=O)=O)C(=O)NO)cc2)c2ccccc2n1
: