Target
72 kDa type IV collagenase
Ligand
BDBM50177314
Substrate
Meas. Tech.
ChEMBL_334535 (CHEMBL862518)
Ki
>3333±n/a nM
Citation
 Cherney, RJKing, BWGilmore, JLLiu, RQCovington, MBDuan, JJDecicco, CP Conversion of potent MMP inhibitors into selective TACE inhibitors. Bioorg Med Chem Lett 16:1028-31 (2006)  
Target
Name:
72 kDa type IV collagenase
Synonyms:
72 kDa gelatinase CLG4A Gelatinase A (MMP-2) MMP2_HUMAN Matrix metalloproteinase-2 (MMP 2) Matrix metalloproteinases 2 (MMP-2) | TBE-1
Type:
Enzyme
Mol. Mass.:
73870.36
Organism:
Homo sapiens (Human)
Description:
P08253
Residue:
660
  
Inhibitor
Name:
BDBM50177314
Synonyms:
2-[4-(2-methyl-quinolin-4-ylmethoxy)-phenyl]-1,1-dioxo-[1,2,5]thiadiazolidine-3-carboxylic acid hydroxyamide | CHEMBL379469
Type:
Small organic molecule
Emp. Form.:
C20H20N4O5S
Mol. Mass.:
428.462
SMILES:
Cc1cc(COc2ccc(cc2)N2C(CNS2(=O)=O)C(=O)NO)c2ccccc2n1
: