Target
Ectonucleotide pyrophosphatase/phosphodiesterase family member 2
Ligand
BDBM50177331
Substrate
Meas. Tech.
ChEMBL_329851 (CHEMBL869921)
IC50
232±n/a nM
Citation
 Gududuru, VZeng, KTsukahara, RMakarova, NFujiwara, YPigg, KRBaker, DLTigyi, GMiller, DD Identification of Darmstoff analogs as selective agonists and antagonists of lysophosphatidic acid receptors. Bioorg Med Chem Lett 16:451-6 (2005)  
Target
Name:
Ectonucleotide pyrophosphatase/phosphodiesterase family member 2
Synonyms:
ATX Autotaxin (ATX) ENPP2 Ectonucleotide Pyrophosphatase/Phosphodiesterase 2 (ENPP2) Extracellular lysophospholipase D PDNP2
Type:
Enzyme
Mol. Mass.:
99007.13
Organism:
Homo sapiens (Human)
Description:
Q13822
Residue:
863
  
Inhibitor
Name:
BDBM50177331
Synonyms:
CHEMBL381470 | potassium (2-dodecyl-1,3-dioxolan-4-yl)methyl hydrogenphosphate
Type:
Small organic molecule
Emp. Form.:
C16H32O6P
Mol. Mass.:
351.396
SMILES:
CCCCCCCCCCCCC1OCC(COP(O)([O-])=O)O1
: