Target
Ectonucleotide pyrophosphatase/phosphodiesterase family member 2
Ligand
BDBM50177330
Substrate
Meas. Tech.
ChEMBL_329851 (CHEMBL869921)
IC50
403±n/a nM
Citation
 Gududuru, VZeng, KTsukahara, RMakarova, NFujiwara, YPigg, KRBaker, DLTigyi, GMiller, DD Identification of Darmstoff analogs as selective agonists and antagonists of lysophosphatidic acid receptors. Bioorg Med Chem Lett 16:451-6 (2005)  
Target
Name:
Ectonucleotide pyrophosphatase/phosphodiesterase family member 2
Synonyms:
ATX Autotaxin (ATX) ENPP2 Ectonucleotide Pyrophosphatase/Phosphodiesterase 2 (ENPP2) Extracellular lysophospholipase D PDNP2
Type:
Enzyme
Mol. Mass.:
99007.13
Organism:
Homo sapiens (Human)
Description:
Q13822
Residue:
863
  
Inhibitor
Name:
BDBM50177330
Synonyms:
CHEMBL425218 | potassium O-((2S,4S)-2-(heptadec-9-enyl)-1,3-dioxolan-4-yl)methyl O-hydrogenphosphorothioate
Type:
Small organic molecule
Emp. Form.:
C21H40O5PS
Mol. Mass.:
435.579
SMILES:
CCCCCCC\C=C\CCCCCCCC[C@H]1OC[C@@H](COP(O)([O-])=S)O1
: