Target
D(2) dopamine receptor
Ligand
BDBM50177344
Substrate
Meas. Tech.
ChEMBL_331691 (CHEMBL865866)
Ki
216±n/a nM
Citation
 Geneste, HBackfisch, GBraje, WDelzer, JHaupt, AHutchins, CWKing, LLKling, ATeschendorf, HJUnger, LWernet, W Synthesis and SAR of highly potent and selective dopamine D(3)-receptor antagonists: 1H-pyrimidin-2-one derivatives. Bioorg Med Chem Lett 16:490-4 (2005)  
Target
Name:
D(2) dopamine receptor
Synonyms:
D(2) dopamine receptor DOPAMINE D2 Long DRD2 Dopamine D2 receptor Dopamine D2 receptor (D2R) Dopamine2-like | d2
Type:
Cell-surface receptors
Mol. Mass.:
50647.10
Organism:
Homo sapiens (Human)
Description:
P14416
Residue:
443
  
Inhibitor
Name:
BDBM50177344
Synonyms:
4-tert-butyl-1-(4-(4-(2-tert-butyl-6-(trifluoromethyl)pyrimidin-4-yl)piperazin-1-yl)butyl)pyrimidin-2(1H)-one | CHEMBL202175
Type:
Small organic molecule
Emp. Form.:
C25H37F3N6O
Mol. Mass.:
494.5961
SMILES:
CC(C)(C)c1ccn(CCCCN2CCN(CC2)c2cc(nc(n2)C(C)(C)C)C(F)(F)F)c(=O)n1
: