Target
D(2) dopamine receptor
Ligand
BDBM50177354
Substrate
Meas. Tech.
ChEMBL_331691 (CHEMBL865866)
Ki
351±n/a nM
Citation
 Geneste, HBackfisch, GBraje, WDelzer, JHaupt, AHutchins, CWKing, LLKling, ATeschendorf, HJUnger, LWernet, W Synthesis and SAR of highly potent and selective dopamine D(3)-receptor antagonists: 1H-pyrimidin-2-one derivatives. Bioorg Med Chem Lett 16:490-4 (2005)  
Target
Name:
D(2) dopamine receptor
Synonyms:
D(2) dopamine receptor DOPAMINE D2 Long DRD2 Dopamine D2 receptor Dopamine D2 receptor (D2R) Dopamine2-like | d2
Type:
Cell-surface receptors
Mol. Mass.:
50647.10
Organism:
Homo sapiens (Human)
Description:
P14416
Residue:
443
  
Inhibitor
Name:
BDBM50177354
Synonyms:
2-(3-(4-(2-tert-butyl-6-(trifluoromethyl)pyrimidin-4-yl)piperazin-1-yl)propylthio)pyrimidin-4-ol CHEMBL439338
Type:
Small organic molecule
Emp. Form.:
C20H27F3N6OS
Mol. Mass.:
456.528
SMILES:
CC(C)(C)c1nc(cc(n1)C(F)(F)F)N1CCN(CCCSc2nccc(=O)[nH]2)CC1
: