Target
D(2) dopamine receptor
Ligand
BDBM50177359
Substrate
Meas. Tech.
ChEMBL_331691 (CHEMBL865866)
Ki
473±n/a nM
Citation
 Geneste, HBackfisch, GBraje, WDelzer, JHaupt, AHutchins, CWKing, LLKling, ATeschendorf, HJUnger, LWernet, W Synthesis and SAR of highly potent and selective dopamine D(3)-receptor antagonists: 1H-pyrimidin-2-one derivatives. Bioorg Med Chem Lett 16:490-4 (2005)  
Target
Name:
D(2) dopamine receptor
Synonyms:
D(2) dopamine receptor DOPAMINE D2 Long DRD2 Dopamine D2 receptor Dopamine D2 receptor (D2R) Dopamine2-like | d2
Type:
Cell-surface receptors
Mol. Mass.:
50647.10
Organism:
Homo sapiens (Human)
Description:
P14416
Residue:
443
  
Inhibitor
Name:
BDBM50177359
Synonyms:
1-(4-(4-(2-tert-butyl-6-(trifluoromethyl)pyrimidin-4-yl)piperazin-1-yl)butyl)-4-hydroxy-2-oxo-1,2-dihydropyrimidine-5-carbonitrile | CHEMBL201509
Type:
Small organic molecule
Emp. Form.:
C22H28F3N7O2
Mol. Mass.:
479.4986
SMILES:
CC(C)(C)c1nc(cc(n1)C(F)(F)F)N1CCN(CCCCn2cc(C#N)c(=O)[nH]c2=O)CC1
: