Target
D(3) dopamine receptor
Ligand
BDBM50177357
Substrate
Meas. Tech.
ChEMBL_331690 (CHEMBL862890)
Ki
1.7±n/a nM
Citation
 Geneste, HBackfisch, GBraje, WDelzer, JHaupt, AHutchins, CWKing, LLKling, ATeschendorf, HJUnger, LWernet, W Synthesis and SAR of highly potent and selective dopamine D(3)-receptor antagonists: 1H-pyrimidin-2-one derivatives. Bioorg Med Chem Lett 16:490-4 (2005)  
Target
Name:
D(3) dopamine receptor
Synonyms:
DOPAMINE D3 DRD3_HUMAN Dopamine D3 receptor (D3) Dopamine receptor Dopamine receptor D3
Type:
Mol. Mass.:
44243.43
Organism:
Homo sapiens (Human)
Description:
Residue:
400
  
Inhibitor
Name:
BDBM50177357
Synonyms:
1-(4-(4-(2-tert-butyl-6-(trifluoromethyl)pyrimidin-4-yl)piperazin-1-yl)butyl)-5-ethyl-4-hydroxypyrimidin-2(1H)-one | CHEMBL202774
Type:
Small organic molecule
Emp. Form.:
C23H33F3N6O2
Mol. Mass.:
482.5423
SMILES:
CCc1cn(CCCCN2CCN(CC2)c2cc(nc(n2)C(C)(C)C)C(F)(F)F)c(=O)[nH]c1=O
: