Target
4-aminobutyrate aminotransferase, mitochondrial
Ligand
BDBM50177405
Substrate
Meas. Tech.
ChEMBL_332431 (CHEMBL867027)
IC50
17100±n/a nM
Citation
 Tao, YHYuan, ZTang, XQXu, HBYang, XL Inhibition of GABA shunt enzymes' activity by 4-hydroxybenzaldehyde derivatives. Bioorg Med Chem Lett 16:592-5 (2005)  
Target
Name:
4-aminobutyrate aminotransferase, mitochondrial
Synonyms:
(S)-3-amino-2-methylpropionate transaminase ABAT GABA transaminase GABA-T GABT_HUMAN L-AIBAT
Type:
PROTEIN
Mol. Mass.:
56449.39
Organism:
Homo sapiens (Human)
Description:
ChEMBL_1459248
Residue:
500
  
Inhibitor
Name:
BDBM50177405
Synonyms:
3-methoxy-4-hydroxybenzaldehyde 4-hydroxy-m-anisaldehyde p-hydroxy-m-methoxybenzaldehyde vanillin
Type:
Small organic molecule
Emp. Form.:
C8H8O3
Mol. Mass.:
152.1473
SMILES:
COc1cc(C=O)ccc1O
: