Target
Procathepsin L
Ligand
BDBM50177771
Substrate
Meas. Tech.
ChEMBL_325794 (CHEMBL862700)
Ki
1600±n/a nM
Citation
 Palmer, JTBryant, CWang, DXDavis, DESetti, ELRydzewski, RMVenkatraman, STian, ZQBurrill, LCMendonca, RVSpringman, EMcCarter, JChung, TCheung, HJanc, JWMcGrath, MSomoza, JREnriquez, PYu, ZWStrickley, RMLiu, LVenuti, MCPercival, MDFalgueyret, JPPrasit, POballa, RRiendeau, DYoung, RNWesolowski, GRodan, SBJohnson, CKimmel, DBRodan, G Design and synthesis of tri-ring P3 benzamide-containing aminonitriles as potent, selective, orally effective inhibitors of cathepsin K. J Med Chem 48:7520-34 (2005)  
Target
Name:
Procathepsin L
Synonyms:
CATL1_HUMAN CTSL CTSL1 Cathepsin L Cathepsin L1 heavy chain MEP cathepsin L preproprotein
Type:
Enzyme
Mol. Mass.:
37557.19
Organism:
Homo sapiens (Human)
Description:
Purchased from Calbiochem (San Diego, CA).
Residue:
333
  
Inhibitor
Name:
BDBM50177771
Synonyms:
4'-(4-tert-Butylamino-piperidin-1-yl)-biphenyl-4-carboxylic acid [1-(cyanomethyl-carbamoyl)-cyclohexyl]-amide | CHEMBL199163
Type:
Small organic molecule
Emp. Form.:
C31H41N5O2
Mol. Mass.:
515.6895
SMILES:
CC(C)(C)NC1CCN(CC1)c1ccc(cc1)-c1ccc(cc1)C(=O)NC1(CCCCC1)C(=O)NCC#N
: