Target
Cathepsin K
Ligand
BDBM50410602
Substrate
Meas. Tech.
ChEMBL_325792 (CHEMBL862698)
Ki
18±n/a nM
Citation
 Palmer, JTBryant, CWang, DXDavis, DESetti, ELRydzewski, RMVenkatraman, STian, ZQBurrill, LCMendonca, RVSpringman, EMcCarter, JChung, TCheung, HJanc, JWMcGrath, MSomoza, JREnriquez, PYu, ZWStrickley, RMLiu, LVenuti, MCPercival, MDFalgueyret, JPPrasit, POballa, RRiendeau, DYoung, RNWesolowski, GRodan, SBJohnson, CKimmel, DBRodan, G Design and synthesis of tri-ring P3 benzamide-containing aminonitriles as potent, selective, orally effective inhibitors of cathepsin K. J Med Chem 48:7520-34 (2005)  
Target
Name:
Cathepsin K
Synonyms:
CATK_RABIT | CTSK
Type:
Enzyme
Mol. Mass.:
36879.51
Organism:
Oryctolagus cuniculus (rabbit)
Description:
Residue:
329
  
Inhibitor
Name:
BDBM50410602
Synonyms:
CHEMBL370786
Type:
Small organic molecule
Emp. Form.:
C16H18BrN3O2
Mol. Mass.:
364.237
SMILES:
Brc1ccc(cc1)C(=O)NC1(CCCCC1)C(=O)NCC#N
: