Target
Fibroblast growth factor receptor 1
Ligand
BDBM4367
Substrate
Meas. Tech.
ChEMBL_331143 (CHEMBL862244)
IC50
4900±n/a nM
Citation
 Lee, KIPark, YPark, SJHwang, JHLee, SJKim, GDPark, WKLee, SJeong, DKong, JYKang, HKCho, H Naphthofuroquinone derivatives: inhibition of receptor tyrosine kinases. Bioorg Med Chem Lett 16:737-42 (2005)  
Target
Name:
Fibroblast growth factor receptor 1
Synonyms:
BFGFR Basic fibroblast growth factor receptor 1 (FGFR1) CEK FGFR-1 FGFR-1, (FL) FGFR1_HUMAN FLT2 Fibroblast growth factor receptor 1 (FGFR-1) Fms-like tyrosine kinase 2 N-sam bFGF-R | c-fgr
Type:
Receptor
Mol. Mass.:
91861.70
Organism:
Homo sapiens (Human)
Description:
P11362
Residue:
822
  
Inhibitor
Name:
BDBM4367
Synonyms:
(3Z)-2-amino-3-[(3,4,5-trihydroxyphenyl)methylidene]prop-1-ene-1,1,3-tricarbonitrile benzylidenemalononitrile (BMN) deriv. 51
Type:
Small organic molecule
Emp. Form.:
C13H8N4O3
Mol. Mass.:
268.2276
SMILES:
Oc1cc(C=C(C#N)C(=N)C(C#N)C#N)cc(O)c1O
: