Target
Vascular endothelial growth factor receptor 2
Ligand
BDBM50178492
Substrate
Meas. Tech.
ChEMBL_331142 (CHEMBL862243)
IC50
5500±n/a nM
Citation
 Lee, KIPark, YPark, SJHwang, JHLee, SJKim, GDPark, WKLee, SJeong, DKong, JYKang, HKCho, H Naphthofuroquinone derivatives: inhibition of receptor tyrosine kinases. Bioorg Med Chem Lett 16:737-42 (2005)  
Target
Name:
Vascular endothelial growth factor receptor 2
Synonyms:
CD_antigen=CD309 Fetal liver kinase 1 (FLK-1) KDR Protein-tyrosine kinase receptor Flk-1 VEGFR-2 VEGFR2 Vascular Endothelial Growth Factor Receptor Kinase 2 Vascular endothelial growth factor receptor 2 (KDR) Vascular endothelial growth factor receptor 2 (VEGFR2) Vascular endothelial growth factor receptor-2 (VEGFR-2)
Type:
Receptor Tyrosine Kinase
Mol. Mass.:
151510.97
Organism:
Homo sapiens (Human)
Description:
P35968
Residue:
1356
  
Inhibitor
Name:
BDBM50178492
Synonyms:
7,12-dioxo-5-(2-pyrrolidin-1-yl-ethoxy)-7,12-dihydro-dinaphtho[1,2-b;2',3'-d]furan-6-carboxylic acid methyl ester | CHEMBL202244
Type:
Small organic molecule
Emp. Form.:
C28H23NO6
Mol. Mass.:
469.4853
SMILES:
COC(=O)c1c(OCCN2CCCC2)c2ccccc2c2oc3c(C(=O)c4ccccc4C3=O)c12
: