Target
Platelet-derived growth factor receptor beta
Ligand
BDBM50178491
Substrate
Meas. Tech.
ChEMBL_331144 (CHEMBL862245)
IC50
10200±n/a nM
Citation
 Lee, KIPark, YPark, SJHwang, JHLee, SJKim, GDPark, WKLee, SJeong, DKong, JYKang, HKCho, H Naphthofuroquinone derivatives: inhibition of receptor tyrosine kinases. Bioorg Med Chem Lett 16:737-42 (2005)  
Target
Name:
Platelet-derived growth factor receptor beta
Synonyms:
Beta-type platelet-derived growth factor receptor CD140b antigen PDGF Receptor Substrate PDGFR PDGFR-1 PDGFRB PGFRB_HUMAN Platelet-derived growth factor receptor 1 Platelet-derived growth factor receptor beta (PDGFR-beta) Platelet-derived growth factor receptor beta (PDGFRbeta) | VHL/PDGFRB
Type:
Enzyme
Mol. Mass.:
123922.25
Organism:
Homo sapiens (Human)
Description:
P09619
Residue:
1106
  
Inhibitor
Name:
BDBM50178491
Synonyms:
5-(3-dimethylamino-propoxy)-7,12-dioxo-7,12-dihydro-dinaphtho[1,2-b;2',3'-d]furan-6-carboxylic acid methyl ester | CHEMBL383030
Type:
Small organic molecule
Emp. Form.:
C27H23NO6
Mol. Mass.:
457.4746
SMILES:
COC(=O)c1c(OCCCN(C)C)c2ccccc2c2oc3c(C(=O)c4ccccc4C3=O)c12
: