Target
Amyloid-beta precursor protein
Ligand
BDBM50178535
Substrate
Meas. Tech.
ChEMBL_339444 (CHEMBL866523)
Ki
500±n/a nM
Citation
 Chandra, RKung, MPKung, HF Design, synthesis, and structure-activity relationship of novel thiophene derivatives for beta-amyloid plaque imaging. Bioorg Med Chem Lett 16:1350-2 (2006)  
Target
Name:
Amyloid-beta precursor protein
Synonyms:
A4 ABPP AICD-50 AICD-59 AID(57) APP Alzheimer disease amyloid protein Amyloid beta Protein Amyloid beta protein Abeta(1-42) Amyloid intracellular domain 57 Amyloid protein (Abeta42b) Beta amyloid A4 protein Beta-APP42 Beta-amyloid protein 42 C83 CVAP Gamma Secretase Gamma-CTF(57) Gamma-secretase Gamma-secretase C-terminal fragment 57 P3(40) PN-II Protease nexin-II S-APP-beta Soluble APP-beta | beta-Amyloid Precursor Protein (APP)
Type:
Single-pass type I membrane protein
Mol. Mass.:
86890.41
Organism:
Homo sapiens (Human)
Description:
P05067
Residue:
770
  
Inhibitor
Name:
BDBM50178535
Synonyms:
4-(5-(4-methoxyphenyl)thiophen-2-yl)-N,N-dimethylbenzenamine | CHEMBL438972
Type:
Small organic molecule
Emp. Form.:
C19H19NOS
Mol. Mass.:
309.425
SMILES:
COc1ccc(cc1)-c1ccc(s1)-c1ccc(cc1)N(C)C
: