Target
D(3) dopamine receptor
Ligand
BDBM50178621
Substrate
Meas. Tech.
ChEMBL_325303 (CHEMBL859710)
Ki
11.9±n/a nM
Citation
 Leopoldo, MLacivita, EColabufo, NAContino, MBerardi, FPerrone, R First structure-activity relationship study on dopamine D3 receptor agents with N-[4-(4-arylpiperazin-1-yl)butyl]arylcarboxamide structure. J Med Chem 48:7919-22 (2005)  
Target
Name:
D(3) dopamine receptor
Synonyms:
DOPAMINE D3 DRD3_HUMAN Dopamine D3 receptor (D3) Dopamine receptor Dopamine receptor D3
Type:
Mol. Mass.:
44243.43
Organism:
Homo sapiens (Human)
Description:
Residue:
400
  
Inhibitor
Name:
BDBM50178621
Synonyms:
CHEMBL114541 | N-(4-(4-(2,3-dichlorophenyl)piperazin-1-yl)butyl)benzamide
Type:
Small organic molecule
Emp. Form.:
C21H25Cl2N3O
Mol. Mass.:
406.349
SMILES:
Clc1cccc(N2CCN(CCCCNC(=O)c3ccccc3)CC2)c1Cl
: