Target
Delta-type opioid receptor
Ligand
BDBM50178759
Substrate
Meas. Tech.
ChEMBL_326435 (CHEMBL867593)
Ki
0.06±n/a nM
Citation
 Li, TFujita, YShiotani, KMiyazaki, ATsuda, YAmbo, ASasaki, YJinsmaa, YMarczak, EBryant, SDSalvadori, SLazarus, LHOkada, Y Potent Dmt-Tic pharmacophoric delta- and mu-opioid receptor antagonists. J Med Chem 48:8035-44 (2005)  
Target
Name:
Delta-type opioid receptor
Synonyms:
Cytochrome P450 3A4 Delta opioid receptor Delta-type opioid receptor (DOR) OPRD_RAT Opioid receptor Opioid receptors; mu & delta Ror-a | Voltage-gated potassium channel
Type:
G Protein-Coupled Receptor (GPCR)
Mol. Mass.:
40465.04
Organism:
Rattus norvegicus (rat)
Description:
Competition binding assays were using CHO-K1 cell membranes expressing the opioid receptor.
Residue:
372
  
Inhibitor
Name:
BDBM50178759
Synonyms:
1,6-bis-(N,N-dimethyl-Dmt-Tic-NH)hexane | CHEMBL370399
Type:
Small organic molecule
Emp. Form.:
C52H68N6O6
Mol. Mass.:
873.1329
SMILES:
CN(C)[C@@H](Cc1c(C)cc(O)cc1C)C(=O)N1Cc2ccccc2CC1C(=O)NCCCCCCNC(=O)C1Cc2ccccc2CN1C(=O)[C@H](Cc1c(C)cc(O)cc1C)N(C)C
: