Target
Mu-type opioid receptor
Ligand
BDBM50178760
Substrate
Meas. Tech.
ChEMBL_326436 (CHEMBL867594)
Ki
4.86±n/a nM
Citation
 Li, TFujita, YShiotani, KMiyazaki, ATsuda, YAmbo, ASasaki, YJinsmaa, YMarczak, EBryant, SDSalvadori, SLazarus, LHOkada, Y Potent Dmt-Tic pharmacophoric delta- and mu-opioid receptor antagonists. J Med Chem 48:8035-44 (2005)  
Target
Name:
Mu-type opioid receptor
Synonyms:
MOR-1 Mu-type opioid receptor (MOR) OPRM_RAT Opioid receptor B Ror-b
Type:
G Protein-Coupled Receptor (GPCR)
Mol. Mass.:
44503.11
Organism:
Rattus norvegicus (rat)
Description:
Competition binding assays were carried out using membrane preparations from transfected HN9.10 cells that constitutively expressed the mu opioid receptor.
Residue:
398
  
Inhibitor
Name:
BDBM50178760
Synonyms:
1,10-bis-(Dmt-Tic-amino)decane | CHEMBL373192
Type:
Small organic molecule
Emp. Form.:
C52H68N6O6
Mol. Mass.:
873.1329
SMILES:
Cc1cc(O)cc(C)c1C[C@H](N)C(=O)N1Cc2ccccc2CC1C(=O)NCCCCCCCCCCNC(=O)C1Cc2ccccc2CN1C(=O)[C@@H](N)Cc1c(C)cc(O)cc1C
: