Target
Mu-type opioid receptor
Ligand
BDBM50178754
Substrate
Meas. Tech.
ChEMBL_326441 (CHEMBL867599)
IC50
>10000±n/a nM
Citation
 Li, TFujita, YShiotani, KMiyazaki, ATsuda, YAmbo, ASasaki, YJinsmaa, YMarczak, EBryant, SDSalvadori, SLazarus, LHOkada, Y Potent Dmt-Tic pharmacophoric delta- and mu-opioid receptor antagonists. J Med Chem 48:8035-44 (2005)  
Target
Name:
Mu-type opioid receptor
Synonyms:
M-OR-1 Mu opioid receptor OPIATE Mu OPRM_CAVPO
Type:
Enzyme Catalytic Domain
Mol. Mass.:
11165.58
Organism:
GUINEA PIG
Description:
P97266
Residue:
98
  
Inhibitor
Name:
BDBM50178754
Synonyms:
3,6-bis-(N,N-dimethyl-Dmt-Tic-NH-propyl)-2(1H)-pyrazinone | CHEMBL261905
Type:
Small organic molecule
Emp. Form.:
C57H72N8O7
Mol. Mass.:
981.231
SMILES:
CN(C)[C@@H](Cc1c(C)cc(O)cc1C)C(=O)N1Cc2ccccc2CC1C(=O)NCCCc1[nH]c(=O)c(CCCNC(=O)C2Cc3ccccc3CN2C(=O)[C@H](Cc2c(C)cc(O)cc2C)N(C)C)nc1C
: