Target
NAD-dependent protein deacetylase sirtuin-1
Ligand
BDBM50178766
Substrate
Meas. Tech.
ChEMBL_325278 (CHEMBL859689)
IC50
124±n/a nM
Citation
 Napper, ADHixon, JMcDonagh, TKeavey, KPons, JFBarker, JYau, WTAmouzegh, PFlegg, AHamelin, EThomas, RJKates, MJones, SNavia, MASaunders, JODiStefano, PSCurtis, R Discovery of indoles as potent and selective inhibitors of the deacetylase SIRT1. J Med Chem 48:8045-54 (2005)  
Target
Name:
NAD-dependent protein deacetylase sirtuin-1
Synonyms:
NAD-Dependent Deacetylase Sirtuin-1 NAD-dependent protein deacetylase sirtuin-1 (SIRT1) SIR2-like protein 1 SIRT1 Sirtuin-1 (SIRT1) | hSIR2
Type:
Developmental protein; hydrolase
Mol. Mass.:
81626.66
Organism:
Homo sapiens (Human)
Description:
Residue:
747
  
Inhibitor
Name:
BDBM50178766
Synonyms:
2-chloro-5,6,7,8,9,10-hexahydrocyclohepta[b]indole-6-carboxamide CHEMBL446446
Type:
Small organic molecule
Emp. Form.:
C14H15ClN2O
Mol. Mass.:
262.735
SMILES:
NC(=O)C1CCCCc2c1[nH]c1ccc(Cl)cc21
: