Target
DNA topoisomerase 4 subunit A
Ligand
BDBM50117914
Substrate
Meas. Tech.
ChEMBL_340188 (CHEMBL864372)
IC50
1200±n/a nM
Citation
 Wiles, JAWang, QLucien, EHashimoto, ASong, YCheng, JMarlor, CWOu, YPodos, SDThanassi, JAThoma, CLDeshpande, MPucci, MJBradbury, BJ Isothiazoloquinolones containing functionalized aromatic hydrocarbons at the 7-position: synthesis and in vitro activity of a series of potent antibacterial agents with diminished cytotoxicity in human cells. Bioorg Med Chem Lett 16:1272-6 (2006)  
Target
Name:
DNA topoisomerase 4 subunit A
Synonyms:
PARC_STAAU grlA | parC
Type:
PROTEIN
Mol. Mass.:
91040.14
Organism:
Staphylococcus aureus
Description:
ChEMBL_340188
Residue:
800
  
Inhibitor
Name:
BDBM50117914
Synonyms:
1-Cyclopropyl-1,4-dihydro-6-fluoro-8-methoxy-7-(3-methyl-1-piperazinyl)-4-oxo-3-quinolinecarboxylic acid AM 1155 GATIFLOXACIN
Type:
Small organic molecule
Emp. Form.:
C19H22FN3O4
Mol. Mass.:
375.3941
SMILES:
COc1c(N2CCNC(C)C2)c(F)cc2c1n(cc(C(O)=O)c2=O)C1CC1
: