Target
Tyrosine-protein phosphatase non-receptor type 1
Ligand
BDBM50179008
Substrate
Meas. Tech.
ChEMBL_339770 (CHEMBL862180)
IC50
2600±n/a nM
Citation
 Cui, LNa, MOh, HBae, EYJeong, DGRyu, SEKim, SKim, BYOh, WKAhn, JS Protein tyrosine phosphatase 1B inhibitors from Morus root bark. Bioorg Med Chem Lett 16:1426-9 (2006)  
Target
Name:
Tyrosine-protein phosphatase non-receptor type 1
Synonyms:
PTN1_HUMAN PTPN1 Protein tyrosine phosphatase-1B (PTP1B) Protein-tyrosine phosphatase 1B (PTP1B) Tyrosine-protein phosphatase non-receptor type 1 (PTP1B)
Type:
Protein phosphatase
Mol. Mass.:
49963.76
Organism:
Homo sapiens (Human)
Description:
Human recombinant GST-fusion PTP1B (1-435).
Residue:
435
  
Inhibitor
Name:
BDBM50179008
Synonyms:
CHEMBL204813 | sanggenon C
Type:
Small organic molecule
Emp. Form.:
C40H36O12
Mol. Mass.:
708.7066
SMILES:
[#6]\[#6](-[#6])=[#6]/[#6][C@]12[#8]-c3cc(-[#8])c(-[#6@H]-4-[#6]=[#6](-[#6])-[#6]-[#6@@H](-[#6@H]-4-[#6](=O)-c4ccc(-[#8])cc4-[#8])-c4ccc(-[#8])cc4-[#8])c(-[#8])c3-[#6](=O)[C@@]1([#8])[#8]-c1cc(-[#8])ccc21
: