Target
Tyrosine-protein phosphatase non-receptor type 1
Ligand
BDBM50179009
Substrate
Meas. Tech.
ChEMBL_339770 (CHEMBL862180)
IC50
16900±n/a nM
Citation
 Cui, LNa, MOh, HBae, EYJeong, DGRyu, SEKim, SKim, BYOh, WKAhn, JS Protein tyrosine phosphatase 1B inhibitors from Morus root bark. Bioorg Med Chem Lett 16:1426-9 (2006)  
Target
Name:
Tyrosine-protein phosphatase non-receptor type 1
Synonyms:
PTN1_HUMAN PTPN1 Protein tyrosine phosphatase-1B (PTP1B) Protein-tyrosine phosphatase 1B (PTP1B) Tyrosine-protein phosphatase non-receptor type 1 (PTP1B)
Type:
Protein phosphatase
Mol. Mass.:
49963.76
Organism:
Homo sapiens (Human)
Description:
Human recombinant GST-fusion PTP1B (1-435).
Residue:
435
  
Inhibitor
Name:
BDBM50179009
Synonyms:
CHEMBL377937 | Kuwanon L
Type:
Small organic molecule
Emp. Form.:
C35H30O11
Mol. Mass.:
626.6061
SMILES:
CC1=C[C@@H]([C@H]([C@@H](C1)c1ccc(O)cc1O)C(=O)c1ccc(O)cc1O)c1c(O)ccc([C@@H]2CC(=O)c3c(O)cc(O)cc3O2)c1O
: