Target
Dual specificity protein phosphatase 3
Ligand
BDBM50179013
Substrate
Meas. Tech.
ChEMBL_339771 (CHEMBL862182)
IC50
>80000±n/a nM
Citation
 Cui, LNa, MOh, HBae, EYJeong, DGRyu, SEKim, SKim, BYOh, WKAhn, JS Protein tyrosine phosphatase 1B inhibitors from Morus root bark. Bioorg Med Chem Lett 16:1426-9 (2006)  
Target
Name:
Dual specificity protein phosphatase 3
Synonyms:
DUS3_HUMAN Dual specificity protein phosphatase (VHR) Dual specificity protein phosphatase VHR Tyrosine-protein phosphatase non-receptor type 1 | VHR
Type:
Hydrolase
Mol. Mass.:
20480.58
Organism:
Homo sapiens (Human)
Description:
Residue:
185
  
Inhibitor
Name:
BDBM50179013
Synonyms:
CHEMBL205924 | moracin O
Type:
Small organic molecule
Emp. Form.:
C19H18O5
Mol. Mass.:
326.3432
SMILES:
CC(C)(O)C1Cc2cc3cc(oc3cc2O1)-c1cc(O)cc(O)c1
: