Target
Poly [ADP-ribose] polymerase 1
Ligand
BDBM50179058
Substrate
Meas. Tech.
ChEMBL_335752 (CHEMBL860595)
IC50
162±n/a nM
Citation
 Wells, GJBihovsky, RHudkins, RLAtor, MAHusten, J Synthesis and structure-activity relationships of novel pyrrolocarbazole lactam analogs as potent and cell-permeable inhibitors of poly(ADP-ribose)polymerase-1 (PARP-1). Bioorg Med Chem Lett 16:1151-5 (2006)  
Target
Name:
Poly [ADP-ribose] polymerase 1
Synonyms:
(ARTD1 or PARP1) 2.4.2.30 ADPRT ARTD1 Human diphtheria toxin-like ADP-ribosyltransferase (ARTD1 or PARP1) NT-PARP-1 PARP1 PPOL Poly [ADP-ribose] polymerase 1 (PARP) Poly [ADP-ribose] polymerase 1 (PARP1) Poly [ADP-ribose] polymerase 1, 28-kDa form Poly [ADP-ribose] polymerase 1, processed C-terminus Poly [ADP-ribose] polymerase-1 Poly(ADP-ribose) polymerase-1 (ARTD1/PARP1) Protein poly-ADP-ribosyltransferase PARP1 | Synonyms=ADPRT
Type:
Mol. Mass.:
113114.22
Organism:
Homo sapiens (Human)
Description:
P09874
Residue:
1014
  
Inhibitor
Name:
BDBM50179058
Synonyms:
4-oxo-2,3,4,5,6,11-hexahydro-1H-5,11-diaza-benzo[a]trindene-8-carboxylic acid (2-morpholin-4-yl-ethyl)-amide | CHEMBL204898
Type:
Small organic molecule
Emp. Form.:
C24H26N4O3
Mol. Mass.:
418.4882
SMILES:
O=C(NCCN1CCOCC1)c1ccc2[nH]c3c4CCCc4c4C(=O)NCc4c3c2c1
: