Target
Vascular endothelial growth factor receptor 1
Ligand
BDBM50179144
Substrate
Meas. Tech.
ChEMBL_339232 (CHEMBL867220)
IC50
340±n/a nM
Citation
 Kiselyov, ASSemenova, MSemenov, VVPiatnitski, E 2-((1H-Azol-1-yl)methyl)-N-arylbenzamides: novel dual inhibitors of VEGFR-1/2 kinases. Bioorg Med Chem Lett 16:1726-30 (2006)  
Target
Name:
Vascular endothelial growth factor receptor 1
Synonyms:
FLT FRT Fms-like tyrosine kinase 1 Tyrosine-protein kinase FRT VEGFR-1 VGFR1_HUMAN Vascular endothelial growth factor receptor 1 (FLT1) Vascular endothelial growth factor receptor 1 and 2 (Flt-1 and KDR) Vascular permeability factor receptor vascular endothelial growth factor/vascular permeability factor receptor
Type:
Receptor Tyrosine Kinase
Mol. Mass.:
150800.23
Organism:
Homo sapiens (Human)
Description:
P17948
Residue:
1338
  
Inhibitor
Name:
BDBM50179144
Synonyms:
2-((1H-pyrrolo[3,2-c]pyridin-1-yl)methyl)-N-(4-morpholinophenyl)benzamide | CHEMBL377081
Type:
Small organic molecule
Emp. Form.:
C25H24N4O2
Mol. Mass.:
412.4837
SMILES:
O=C(Nc1ccc(cc1)N1CCOCC1)c1ccccc1Cn1ccc2cnccc12
: