Target
Vascular endothelial growth factor receptor 2
Ligand
BDBM50179144
Substrate
Meas. Tech.
ChEMBL_339231 (CHEMBL866567)
IC50
280±n/a nM
Citation
 Kiselyov, ASSemenova, MSemenov, VVPiatnitski, E 2-((1H-Azol-1-yl)methyl)-N-arylbenzamides: novel dual inhibitors of VEGFR-1/2 kinases. Bioorg Med Chem Lett 16:1726-30 (2006)  
Target
Name:
Vascular endothelial growth factor receptor 2
Synonyms:
CD_antigen=CD309 Fetal liver kinase 1 (FLK-1) KDR Protein-tyrosine kinase receptor Flk-1 VEGFR-2 VEGFR2 Vascular Endothelial Growth Factor Receptor Kinase 2 Vascular endothelial growth factor receptor 2 (KDR) Vascular endothelial growth factor receptor 2 (VEGFR2) Vascular endothelial growth factor receptor-2 (VEGFR-2)
Type:
Receptor Tyrosine Kinase
Mol. Mass.:
151510.97
Organism:
Homo sapiens (Human)
Description:
P35968
Residue:
1356
  
Inhibitor
Name:
BDBM50179144
Synonyms:
2-((1H-pyrrolo[3,2-c]pyridin-1-yl)methyl)-N-(4-morpholinophenyl)benzamide | CHEMBL377081
Type:
Small organic molecule
Emp. Form.:
C25H24N4O2
Mol. Mass.:
412.4837
SMILES:
O=C(Nc1ccc(cc1)N1CCOCC1)c1ccccc1Cn1ccc2cnccc12
: