Target
Vascular endothelial growth factor receptor 1
Ligand
BDBM9503
Substrate
Meas. Tech.
ChEMBL_339232 (CHEMBL867220)
IC50
170±n/a nM
Citation
 Kiselyov, ASSemenova, MSemenov, VVPiatnitski, E 2-((1H-Azol-1-yl)methyl)-N-arylbenzamides: novel dual inhibitors of VEGFR-1/2 kinases. Bioorg Med Chem Lett 16:1726-30 (2006)  
Target
Name:
Vascular endothelial growth factor receptor 1
Synonyms:
FLT FRT Fms-like tyrosine kinase 1 Tyrosine-protein kinase FRT VEGFR-1 VGFR1_HUMAN Vascular endothelial growth factor receptor 1 (FLT1) Vascular endothelial growth factor receptor 1 and 2 (Flt-1 and KDR) Vascular permeability factor receptor vascular endothelial growth factor/vascular permeability factor receptor
Type:
Receptor Tyrosine Kinase
Mol. Mass.:
150800.23
Organism:
Homo sapiens (Human)
Description:
P17948
Residue:
1338
  
Inhibitor
Name:
BDBM9503
Synonyms:
2-[(pyridin-4-ylmethyl)amino]-N-[3-(trifluoromethyl)phenyl]benzamide anthranyl amide derivative C
Type:
Small organic molecule
Emp. Form.:
C20H16F3N3O
Mol. Mass.:
371.3557
SMILES:
FC(F)(F)c1cccc(NC(=O)c2ccccc2NCc2ccncc2)c1
: