Target
Adenosine receptor A1
Ligand
BDBM50179182
Substrate
Meas. Tech.
ChEMBL_325326 (CHEMBL860161)
Ki
0.48±n/a nM
Citation
 Jacobson, KAGao, ZGTchilibon, SDuong, HTJoshi, BVSonin, DLiang, BT Semi-rational design of (north)-methanocarba nucleosides as dual acting A(1) and A(3) adenosine receptor agonists: novel prototypes for cardioprotection. J Med Chem 48:8103-7 (2005)  
Target
Name:
Adenosine receptor A1
Synonyms:
A1 adenosine receptor (hA1) AA1R_HUMAN ADORA1 Adenosine A1-receptor Adenosine receptor A1 (hA1) | Adenosine transporter (AdT)
Type:
G Protein-Coupled Receptor (GPCR)
Mol. Mass.:
36520.92
Organism:
Homo sapiens (Human)
Description:
P30542
Residue:
326
  
Inhibitor
Name:
BDBM50179182
Synonyms:
(2R,3R,4S,5R)-2-(6-(bicyclo[2.2.1]heptan-7-ylamino)-9H-purin-9-yl)-5-(hydroxymethyl)-tetrahydrofuran-3,4-diol | CHEMBL176551
Type:
Small organic molecule
Emp. Form.:
C17H23N5O4
Mol. Mass.:
361.3956
SMILES:
OC[C@H]1O[C@H]([C@H](O)[C@@H]1O)n1cnc2c(NC3C4CCC3CC4)ncnc12
: