Target
P2Y purinoceptor 6
Ligand
BDBM50179185
Substrate
Meas. Tech.
ChEMBL_325347 (CHEMBL858654)
EC50
1720±n/a nM
Citation
 Costanzi, SJoshi, BVMaddileti, SMamedova, LGonzalez-Moa, MJMarquez, VEHarden, TKJacobson, KA Human P2Y(6) receptor: molecular modeling leads to the rational design of a novel agonist based on a unique conformational preference. J Med Chem 48:8108-11 (2005)  
Target
Name:
P2Y purinoceptor 6
Synonyms:
P2RY6 P2Y purinoceptor 6 Pyrimidinergic receptor P2Y6
Type:
PROTEIN
Mol. Mass.:
36452.29
Organism:
Homo sapiens (Human)
Description:
ChEMBL_1511151
Residue:
328
  
Inhibitor
Name:
BDBM50179185
Synonyms:
((2R,3S,5R)-5-(2,4-dioxo-3,4-dihydropyrimidin-1(2H)-yl)-3-hydroxytetrahydrofuran-2-yl)methyl trihydrogen diphosphate CHEMBL9519 | DEOXYURIDINE-5'-DIPHOSPHATE
Type:
Small organic molecule
Emp. Form.:
C9H14N2O11P2
Mol. Mass.:
388.1618
SMILES:
O[C@H]1C[C@@H](O[C@@H]1COP(O)(=O)OP(O)(O)=O)n1ccc(=O)[nH]c1=O
: