Target
Tissue alpha-L-fucosidase
Ligand
BDBM50179479
Substrate
Meas. Tech.
ChEMBL_335897 (CHEMBL859282)
Ki
13000±n/a nM
Citation
 Dubernet, MDefoin, ATarnus, C Asymmetric synthesis of the L-fuco-nojirimycin, a nanomolar alpha-L-fucosidase inhibitor. Bioorg Med Chem Lett 16:1172-4 (2006)  
Target
Name:
Tissue alpha-L-fucosidase
Synonyms:
Alpha-L-fucosidase 1 FUCO_BOVIN
Type:
PROTEIN
Mol. Mass.:
54093.12
Organism:
Bos taurus
Description:
ChEMBL_335897
Residue:
468
  
Inhibitor
Name:
BDBM50179479
Synonyms:
(2S,3R,4S,5S,6R)-3,4,5-trihydroxy-6-methylpiperidine-2-sulfonic acid | CHEMBL203795
Type:
Small organic molecule
Emp. Form.:
C6H13NO6S
Mol. Mass.:
227.236
SMILES:
C[C@H]1N[C@H]([C@H](O)[C@@H](O)[C@H]1O)S(O)(=O)=O
: