Target
Oxysterols receptor LXR-alpha
Ligand
BDBM50179870
Substrate
Meas. Tech.
ChEMBL_340909 (CHEMBL860635)
EC50
80±n/a nM
Citation
 Li, LLiu, JZhu, LCutler, SHasegawa, HShan, BMedina, JC Discovery and optimization of a novel series of liver X receptor-alpha agonists. Bioorg Med Chem Lett 16:1638-42 (2006)  
Target
Name:
Oxysterols receptor LXR-alpha
Synonyms:
LXRA Liver X receptor alpha Liver X receptor alpha (NR1H3) NR1H3 Nuclear orphan receptor LXR-alpha | Nuclear receptor subfamily 1 group H member 3
Type:
Enzyme Catalytic Domain
Mol. Mass.:
50403.85
Organism:
Homo sapiens (Human)
Description:
Q13133
Residue:
447
  
Inhibitor
Name:
BDBM50179870
Synonyms:
CHEMBL206445 | N1-(4-(1,1,1,3,3,3-hexafluoro-2-hydroxypropan-2-yl)phenyl)-N1-methylbenzene-1,3-disulfonamide
Type:
Small organic molecule
Emp. Form.:
C16H14F6N2O5S2
Mol. Mass.:
492.413
SMILES:
CN(c1ccc(cc1)C(O)(C(F)(F)F)C(F)(F)F)S(=O)(=O)c1cccc(c1)S(N)(=O)=O
: