Target
Interstitial collagenase
Ligand
BDBM50104001
Substrate
Meas. Tech.
ChEMBL_329819 (CHEMBL862782)
IC50
104±n/a nM
Citation
 Pirard, BMatter, H Matrix metalloproteinase target family landscape: a chemometrical approach to ligand selectivity based on protein binding site analysis. J Med Chem 49:51-69 (2006)  
Target
Name:
Interstitial collagenase
Synonyms:
CLG MMP1 Matrix metalloproteinase-1 | Matrix metalloproteinase-1 (MMP-1)
Type:
Enzyme
Mol. Mass.:
54010.26
Organism:
Homo sapiens (Human)
Description:
P03956
Residue:
469
  
Inhibitor
Name:
BDBM50104001
Synonyms:
4-(benzylthio)-N-hydroxy-2-(N-isobutyl-4-methoxyphenylsulfonamido)butanamide CHEMBL104022
Type:
Small organic molecule
Emp. Form.:
C22H30N2O5S2
Mol. Mass.:
466.614
SMILES:
COc1ccc(cc1)S(=O)(=O)N(CC(C)C)C(CCSCc1ccccc1)C(=O)NO
: