Target
Stromelysin-1
Ligand
BDBM50180017
Substrate
Meas. Tech.
ChEMBL_329821 (CHEMBL862784)
Ki
2900±n/a nM
Citation
 Pirard, BMatter, H Matrix metalloproteinase target family landscape: a chemometrical approach to ligand selectivity based on protein binding site analysis. J Med Chem 49:51-69 (2006)  
Target
Name:
Stromelysin-1
Synonyms:
MMP-3 MMP3_HUMAN Matrix metalloproteinase 3 Matrix metalloproteinase-3 (MMP-3) SL-1 Stromelysin 1 | Transin-1
Type:
Enzyme
Mol. Mass.:
53973.13
Organism:
Homo sapiens (Human)
Description:
P08254
Residue:
477
  
Inhibitor
Name:
BDBM50180017
Synonyms:
14-methylcarbamoyl-2,8-dioxo-3-phenethyl-1,4,9-triaza-cyclotetradecane-5-carboxylic acid | CHEMBL381189
Type:
Small organic molecule
Emp. Form.:
C22H32N4O5
Mol. Mass.:
432.5133
SMILES:
CNC(=O)C1CCCCNC(=O)CCC(NC(CCc2ccccc2)C(=O)N1)C(O)=O
: