Target
Polyprenyl synthetase family protein
Ligand
BDBM50098390
Substrate
Meas. Tech.
ChEMBL_330072 (CHEMBL858875)
IC50
112±n/a nM
Citation
 Hudock, MPSanz-Rodríguez, CESong, YChan, JMZhang, YOdeh, SKosztowski, TLeon-Rossell, AConcepción, JLYardley, VCroft, SLUrbina, JAOldfield, E Inhibition of Trypanosoma cruzi hexokinase by bisphosphonates. J Med Chem 49:215-23 (2006)  
Target
Name:
Polyprenyl synthetase family protein
Synonyms:
Farnesyl diphosphate synthase | Farnesyl pyrophosphate synthase
Type:
PROTEIN
Mol. Mass.:
41078.35
Organism:
Plasmodium falciparum (isolate 3D7)
Description:
ChEMBL_330072
Residue:
362
  
Inhibitor
Name:
BDBM50098390
Synonyms:
(3-methylpyridin-2-ylamino)methylenediphosphonic acid 2-{[hydrogen phosphonato(phosphonato)methyl]amino}-3-methylpyridin-1-ium [(3-Methyl-pyridin-2-ylamino)-phosphono-methyl]-phosphonic acid(NE97200) | [(3-methyl-pyridin-2-ylamino)-phosphono-methyl]-phosphonic acid
Type:
Small organic molecule
Emp. Form.:
C7H12N2O6P2
Mol. Mass.:
282.1275
SMILES:
Cc1cccnc1NC(P(O)(O)=O)P(O)(O)=O
: