Target
Adenosine receptor A3
Ligand
BDBM50180197
Substrate
Meas. Tech.
ChEMBL_330118 (CHEMBL863398)
Ki
0.38±n/a nM
Citation
 Jeong, LSLee, HWJacobson, KAKim, HOShin, DHLee, JAGao, ZGLu, CDuong, HTGunaga, PLee, SKJin, DZChun, MWMoon, HR Structure-activity relationships of 2-chloro-N6-substituted-4'-thioadenosine-5'-uronamides as highly potent and selective agonists at the human A3 adenosine receptor. J Med Chem 49:273-81 (2006)  
Target
Name:
Adenosine receptor A3
Synonyms:
A3 adenosine receptor (hA3) ADORA3 | Adenosine A3 receptor (A3AR)
Type:
G Protein-Coupled Receptor (GPCR)
Mol. Mass.:
36197.32
Organism:
Homo sapiens (Human)
Description:
P0DMS8
Residue:
318
  
Inhibitor
Name:
BDBM50180197
Synonyms:
(2S,3S,4R,5R)-5-(2-chloro-6-(3-iodobenzylamino)-9H-purin-9-yl)-3,4-dihydroxy-N-methyltetrahydrothiophene-2-carboxamide CHEMBL200732
Type:
Small organic molecule
Emp. Form.:
C18H18ClIN6O3S
Mol. Mass.:
560.796
SMILES:
CNC(=O)[C@H]1S[C@H]([C@H](O)[C@@H]1O)n1cnc2c(NCc3cccc(I)c3)nc(Cl)nc12
: