Target
Adenosine receptor A1
Ligand
BDBM50180219
Substrate
Meas. Tech.
ChEMBL_330114 (CHEMBL863394)
Ki
89.2±n/a nM
Citation
 Jeong, LSLee, HWJacobson, KAKim, HOShin, DHLee, JAGao, ZGLu, CDuong, HTGunaga, PLee, SKJin, DZChun, MWMoon, HR Structure-activity relationships of 2-chloro-N6-substituted-4'-thioadenosine-5'-uronamides as highly potent and selective agonists at the human A3 adenosine receptor. J Med Chem 49:273-81 (2006)  
Target
Name:
Adenosine receptor A1
Synonyms:
A1 adenosine receptor (hA1) AA1R_HUMAN ADORA1 Adenosine A1-receptor Adenosine receptor A1 (hA1) | Adenosine transporter (AdT)
Type:
G Protein-Coupled Receptor (GPCR)
Mol. Mass.:
36520.92
Organism:
Homo sapiens (Human)
Description:
P30542
Residue:
326
  
Inhibitor
Name:
BDBM50180219
Synonyms:
(2-chloropurin-9-yl)-3,4-dihydroxytetrahydrothiphene-2-carboxylic acid methyl amide | CHEMBL203357
Type:
Small organic molecule
Emp. Form.:
C11H13ClN6O3S
Mol. Mass.:
344.777
SMILES:
CNC(=O)[C@H]1S[C@H]([C@H](O)[C@@H]1O)n1cnc2c(N)nc(Cl)nc12
: