Target
Adenosine receptor A1
Ligand
BDBM50180210
Substrate
Meas. Tech.
ChEMBL_330114 (CHEMBL863394)
Ki
2±n/a nM
Citation
 Jeong, LSLee, HWJacobson, KAKim, HOShin, DHLee, JAGao, ZGLu, CDuong, HTGunaga, PLee, SKJin, DZChun, MWMoon, HR Structure-activity relationships of 2-chloro-N6-substituted-4'-thioadenosine-5'-uronamides as highly potent and selective agonists at the human A3 adenosine receptor. J Med Chem 49:273-81 (2006)  
Target
Name:
Adenosine receptor A1
Synonyms:
A1 adenosine receptor (hA1) AA1R_HUMAN ADORA1 Adenosine A1-receptor Adenosine receptor A1 (hA1) | Adenosine transporter (AdT)
Type:
G Protein-Coupled Receptor (GPCR)
Mol. Mass.:
36520.92
Organism:
Homo sapiens (Human)
Description:
P30542
Residue:
326
  
Inhibitor
Name:
BDBM50180210
Synonyms:
(2S,3S,4R,5R)-5-(2-chloro-6-(cyclopentylamino)-9H-purin-9-yl)-N-ethyl-3,4-dihydroxy-tetrahydrothiophene-2-carboxamide | CHEMBL202189
Type:
Small organic molecule
Emp. Form.:
C17H23ClN6O3S
Mol. Mass.:
426.921
SMILES:
CCNC(=O)[C@H]1S[C@H]([C@H](O)[C@@H]1O)n1cnc2c(NC3CCCC3)nc(Cl)nc12
: