Target
5-hydroxytryptamine receptor 2B
Ligand
BDBM50180257
Substrate
Meas. Tech.
ChEMBL_329320 (CHEMBL863543)
Ki
15±n/a nM
Citation
 May, JADantanarayana, APZinke, PWMcLaughlin, MASharif, NA 1-((S)-2-aminopropyl)-1H-indazol-6-ol: a potent peripherally acting 5-HT2 receptor agonist with ocular hypotensive activity. J Med Chem 49:318-28 (2006)  
Target
Name:
5-hydroxytryptamine receptor 2B
Synonyms:
5-HT-2B 5-hydroxytryptamine (serotonin) receptor 2B [Homo sapiens] 5-hydroxytryptamine receptor 2C (5HT2C) HTR2B Serotonin 2b (5-HT2b) receptor | Serotonin Receptor 2B
Type:
G Protein-Coupled Receptor (GPCR)
Mol. Mass.:
54312.47
Organism:
Homo sapiens (Human)
Description:
Receptor binding assays were performed using human clone stably expressed in CHO cells.
Residue:
481
  
Inhibitor
Name:
BDBM50180257
Synonyms:
1-(2-aminoethyl)-1H-indazol-6-ol | CHEMBL199385
Type:
Small organic molecule
Emp. Form.:
C9H11N3O
Mol. Mass.:
177.2031
SMILES:
NCCn1ncc2ccc(O)cc12
: