Target
5-hydroxytryptamine receptor 2B
Ligand
BDBM30707
Substrate
Meas. Tech.
ChEMBL_329317 (CHEMBL863540)
EC50
240±n/a nM
Citation
 May, JADantanarayana, APZinke, PWMcLaughlin, MASharif, NA 1-((S)-2-aminopropyl)-1H-indazol-6-ol: a potent peripherally acting 5-HT2 receptor agonist with ocular hypotensive activity. J Med Chem 49:318-28 (2006)  
Target
Name:
5-hydroxytryptamine receptor 2B
Synonyms:
5-HT2B 5HT2B_RAT Serotonin 2b (5-HT2b) receptor Srl
Type:
Enzyme Catalytic Domain
Mol. Mass.:
53668.47
Organism:
RAT
Description:
5-HT2B HTR2B RAT::P30994
Residue:
479
  
Inhibitor
Name:
BDBM30707
Synonyms:
2-(5-methoxy-1H-indol-3-yl)-N,N-dimethyl-ethanamine 2-(5-methoxy-1H-indol-3-yl)ethyl-dimethyl-amine CHEMBL7257 Methoxydimethyltryptamines WO2023019367, Compound 5-MeO-DMT | cid_1832
Type:
Small organic molecule
Emp. Form.:
C13H18N2O
Mol. Mass.:
218.2948
SMILES:
COc1ccc2[nH]cc(CCN(C)C)c2c1
: