Target
5-hydroxytryptamine receptor 2A
Ligand
BDBM50180257
Substrate
Meas. Tech.
ChEMBL_329319 (CHEMBL860341)
Ki
20±n/a nM
Citation
 May, JADantanarayana, APZinke, PWMcLaughlin, MASharif, NA 1-((S)-2-aminopropyl)-1H-indazol-6-ol: a potent peripherally acting 5-HT2 receptor agonist with ocular hypotensive activity. J Med Chem 49:318-28 (2006)  
Target
Name:
5-hydroxytryptamine receptor 2A
Synonyms:
5-HT-2 5-HT2A 5-hydroxytryptamine receptor 2A (5HT-2A) 5HT2A_HUMAN HTR2A | Serotonin receptor 2A
Type:
undefined
Mol. Mass.:
52607.65
Organism:
Homo sapiens (Human)
Description:
P28223
Residue:
471
  
Inhibitor
Name:
BDBM50180257
Synonyms:
1-(2-aminoethyl)-1H-indazol-6-ol | CHEMBL199385
Type:
Small organic molecule
Emp. Form.:
C9H11N3O
Mol. Mass.:
177.2031
SMILES:
NCCn1ncc2ccc(O)cc12
: