Target
Serine/threonine-protein kinase B-raf
Ligand
BDBM50180331
Substrate
Meas. Tech.
ChEMBL_329643 (CHEMBL865836)
IC50
2700±n/a nM
Citation
 Niculescu-Duvaz, IRoman, EWhittaker, SRFriedlos, FKirk, RScanlon, IJDavies, LCNiculescu-Duvaz, DMarais, RSpringer, CJ Novel inhibitors of B-RAF based on a disubstituted pyrazine scaffold. Generation of a nanomolar lead. J Med Chem 49:407-16 (2006)  
Target
Name:
Serine/threonine-protein kinase B-raf
Synonyms:
B-RAF B-Raf proto-oncogene serine/threonine-protein kinase BRAF1 RAFB1 v-Raf murine sarcoma viral oncogene homolog B1
Type:
Serine/threonine-protein kinase
Mol. Mass.:
84446.00
Organism:
Homo sapiens (Human)
Description:
P15056
Residue:
766
  
Inhibitor
Name:
BDBM50180331
Synonyms:
2-(3,5-Dimethoxyphenylamino)-6-(3-acetamidophenyl)pyrazine | CHEMBL425577
Type:
Small organic molecule
Emp. Form.:
C20H20N4O3
Mol. Mass.:
364.3978
SMILES:
COc1cc(Nc2cncc(n2)-c2cccc(NC(C)=O)c2)cc(OC)c1
: