Target
Plasma kallikrein
Ligand
BDBM14927
Substrate
Meas. Tech.
ChEMBL_344178 (CHEMBL868878)
Ki
6±n/a nM
Citation
 Young, WBRai, RShrader, WDBurgess-Henry, JHu, HElrod, KCSprengeler, PAKatz, BASukbuntherng, JMordenti, J Small molecule inhibitors of plasma kallikrein. Bioorg Med Chem Lett 16:2034-6 (2006)  
Target
Name:
Plasma kallikrein
Synonyms:
Fletcher factor KLKB1 Kallikrein Plasma kallikrein heavy chain Plasma prekallikrein
Type:
Protein
Mol. Mass.:
71391.16
Organism:
Homo sapiens (Human)
Description:
P03952
Residue:
638
  
Inhibitor
Name:
BDBM14927
Synonyms:
2-[3-(5-carbamimidoyl-1H-1,3-benzodiazol-2-yl)-4-hydroxy-5-(2-methoxyphenyl)phenyl]butanedioic acid CHEMBL381120
Type:
Small organic molecule
Emp. Form.:
C25H22N4O6
Mol. Mass.:
474.4654
SMILES:
COc1ccccc1-c1cc(cc(-c2nc3ccc(cc3[nH]2)C(N)=N)c1O)C(CC(O)=O)C(O)=O
: