Target
Muscarinic acetylcholine receptor M3
Ligand
BDBM50181093
Substrate
Meas. Tech.
ChEMBL_345379 (CHEMBL861122)
Ki
398±n/a nM
Citation
 Provins, LChristophe, BDanhaive, PDulieu, JDurieu, VGillard, MLebon, FLengelé, SQuéré, Lvan Keulen, B First dual M3 antagonists-PDE4 inhibitors: synthesis and SAR of 4,6-diaminopyrimidine derivatives. Bioorg Med Chem Lett 16:1834-9 (2006)  
Target
Name:
Muscarinic acetylcholine receptor M3
Synonyms:
ACM3_HUMAN Cholinergic, muscarinic M3 Muscarinic receptor M3 | RecName: Full=Muscarinic acetylcholine receptor M3
Type:
Enzyme
Mol. Mass.:
66151.03
Organism:
Homo sapiens (Human)
Description:
P20309
Residue:
590
  
Inhibitor
Name:
BDBM50181093
Synonyms:
(+)-6-(azepan-1-yl)-N-cyclopropyl-2-(2-methylcyclopropyl)pyrimidin-4-amine | CHEMBL206087
Type:
Small organic molecule
Emp. Form.:
C17H26N4
Mol. Mass.:
286.4151
SMILES:
C[C@@H]1C[C@H]1c1nc(NC2CC2)cc(n1)N1CCCCCC1
: