Target
Muscarinic acetylcholine receptor M3
Ligand
BDBM50181120
Substrate
Meas. Tech.
ChEMBL_345379 (CHEMBL861122)
Ki
79±n/a nM
Citation
 Provins, LChristophe, BDanhaive, PDulieu, JDurieu, VGillard, MLebon, FLengelé, SQuéré, Lvan Keulen, B First dual M3 antagonists-PDE4 inhibitors: synthesis and SAR of 4,6-diaminopyrimidine derivatives. Bioorg Med Chem Lett 16:1834-9 (2006)  
Target
Name:
Muscarinic acetylcholine receptor M3
Synonyms:
ACM3_HUMAN Cholinergic, muscarinic M3 Muscarinic receptor M3 | RecName: Full=Muscarinic acetylcholine receptor M3
Type:
Enzyme
Mol. Mass.:
66151.03
Organism:
Homo sapiens (Human)
Description:
P20309
Residue:
590
  
Inhibitor
Name:
BDBM50181120
Synonyms:
CHEMBL206480 | N,2-dicyclopropyl-5-methyl-6-(4-methylenepiperidin-1-yl)pyrimidin-4-amine
Type:
Small organic molecule
Emp. Form.:
C17H24N4
Mol. Mass.:
284.3993
SMILES:
Cc1c(NC2CC2)nc(nc1N1CCC(=C)CC1)C1CC1
: