Target
Muscarinic acetylcholine receptor M3
Ligand
BDBM50181098
Substrate
Meas. Tech.
ChEMBL_345379 (CHEMBL861122)
Ki
200±n/a nM
Citation
 Provins, LChristophe, BDanhaive, PDulieu, JDurieu, VGillard, MLebon, FLengelé, SQuéré, Lvan Keulen, B First dual M3 antagonists-PDE4 inhibitors: synthesis and SAR of 4,6-diaminopyrimidine derivatives. Bioorg Med Chem Lett 16:1834-9 (2006)  
Target
Name:
Muscarinic acetylcholine receptor M3
Synonyms:
ACM3_HUMAN Cholinergic, muscarinic M3 Muscarinic receptor M3 | RecName: Full=Muscarinic acetylcholine receptor M3
Type:
Enzyme
Mol. Mass.:
66151.03
Organism:
Homo sapiens (Human)
Description:
P20309
Residue:
590
  
Inhibitor
Name:
BDBM50181098
Synonyms:
CHEMBL381259 | N4-benzyl-N6,2-dicyclopropyl-5-methylpyrimidine-4,6-diamine
Type:
Small organic molecule
Emp. Form.:
C18H22N4
Mol. Mass.:
294.3941
SMILES:
Cc1c(NCc2ccccc2)nc(nc1NC1CC1)C1CC1
: