Target
Muscarinic acetylcholine receptor M3
Ligand
BDBM50181126
Substrate
Meas. Tech.
ChEMBL_345379 (CHEMBL861122)
Ki
3200±n/a nM
Citation
 Provins, LChristophe, BDanhaive, PDulieu, JDurieu, VGillard, MLebon, FLengelé, SQuéré, Lvan Keulen, B First dual M3 antagonists-PDE4 inhibitors: synthesis and SAR of 4,6-diaminopyrimidine derivatives. Bioorg Med Chem Lett 16:1834-9 (2006)  
Target
Name:
Muscarinic acetylcholine receptor M3
Synonyms:
ACM3_HUMAN Cholinergic, muscarinic M3 Muscarinic receptor M3 | RecName: Full=Muscarinic acetylcholine receptor M3
Type:
Enzyme
Mol. Mass.:
66151.03
Organism:
Homo sapiens (Human)
Description:
P20309
Residue:
590
  
Inhibitor
Name:
BDBM50181126
Synonyms:
1-(2-cyclopropyl-6-(cyclopropylamino)-5-methylpyrimidin-4-yl)piperidin-4-one | CHEMBL382374
Type:
Small organic molecule
Emp. Form.:
C16H22N4O
Mol. Mass.:
286.3721
SMILES:
Cc1c(NC2CC2)nc(nc1N1CCC(=O)CC1)C1CC1
: