Target
Muscarinic acetylcholine receptor M3
Ligand
BDBM50181104
Substrate
Meas. Tech.
ChEMBL_345379 (CHEMBL861122)
Ki
251±n/a nM
Citation
 Provins, LChristophe, BDanhaive, PDulieu, JDurieu, VGillard, MLebon, FLengelé, SQuéré, Lvan Keulen, B First dual M3 antagonists-PDE4 inhibitors: synthesis and SAR of 4,6-diaminopyrimidine derivatives. Bioorg Med Chem Lett 16:1834-9 (2006)  
Target
Name:
Muscarinic acetylcholine receptor M3
Synonyms:
ACM3_HUMAN Cholinergic, muscarinic M3 Muscarinic receptor M3 | RecName: Full=Muscarinic acetylcholine receptor M3
Type:
Enzyme
Mol. Mass.:
66151.03
Organism:
Homo sapiens (Human)
Description:
P20309
Residue:
590
  
Inhibitor
Name:
BDBM50181104
Synonyms:
CHEMBL204471 | N4-benzyl-N6,2-dicyclopropyl-N4,5-dimethylpyrimidine-4,6-diamine
Type:
Small organic molecule
Emp. Form.:
C19H24N4
Mol. Mass.:
308.4207
SMILES:
CN(Cc1ccccc1)c1nc(nc(NC2CC2)c1C)C1CC1
: