Target
D(3) dopamine receptor
Ligand
BDBM50177349
Substrate
Meas. Tech.
ChEMBL_346082 (CHEMBL862318)
Ki
1.9±n/a nM
Citation
 Geneste, HAmberg, WBackfisch, GBeyerbach, ABraje, WMDelzer, JHaupt, AHutchins, CWKing, LLSauer, DRUnger, LWernet, W Synthesis and SAR of highly potent and selective dopamine D3-receptor antagonists: variations on the 1H-pyrimidin-2-one theme. Bioorg Med Chem Lett 16:1934-7 (2006)  
Target
Name:
D(3) dopamine receptor
Synonyms:
DOPAMINE D3 DRD3_HUMAN Dopamine D3 receptor (D3) Dopamine receptor Dopamine receptor D3
Type:
Mol. Mass.:
44243.43
Organism:
Homo sapiens (Human)
Description:
Residue:
400
  
Inhibitor
Name:
BDBM50177349
Synonyms:
1-(4-(4-(2-tert-butyl-6-(trifluoromethyl)pyrimidin-4-yl)piperazin-1-yl)butyl)-4-hydroxypyrimidin-2(1H)-one | CHEMBL383188
Type:
Small organic molecule
Emp. Form.:
C21H29F3N6O2
Mol. Mass.:
454.4892
SMILES:
CC(C)(C)c1nc(cc(n1)C(F)(F)F)N1CCN(CCCCn2ccc(=O)[nH]c2=O)CC1
: